{"text_format":"1","workbook":"xlsx","n_sheets":5,"sheets":["Profile","راهنما","Sheet2","Sheet1","picture"],"not_rendered":{"charts":0,"images":26,"macros":1,"external_links":0,"defined_names":14,"comments":0,"pivot_tables":0},"unopened":[],"bounds":{"document_bytes":16777216,"sheet_cells":100000,"rows_first":2000,"rows_last":500,"rows_between":2000,"halvings":0,"cell_chars":16384,"cell_head_chars":4096},"cells_cut":0,"cells_raw":0,"read":"whole","date_system":"1900"}

{"sheet":"Profile","index":0,"n_rows":99,"n_cols":50,"rows_kept":99,"cut":false,"hidden":false,"merged":[[95,2,99,17],[1,16,10,38],[98,23,99,52],[96,23,97,52],[94,23,95,52],[92,23,93,52],[31,2,33,17],[34,2,38,17],[39,2,45,17],[46,2,50,17],[51,2,57,17],[58,2,66,17],[67,2,69,17],[70,2,75,17],[76,2,82,17],[83,2,88,17],[89,2,94,17],[66,49,67,52],[68,49,69,52],[70,49,71,52],[72,49,73,52],[74,49,75,52],[76,49,77,52],[40,19,41,22],[40,23,41,48],[78,49,79,52],[80,49,81,52],[82,49,83,52],[34,49,35,52],[36,49,37,52],[38,49,39,52],[40,49,41,52],[42,49,43,52],[44,49,45,52],[58,49,59,52],[60,49,61,52],[62,49,63,52],[64,49,65,52],[46,49,47,52],[48,49,49,52],[50,49,51,52],[52,49,53,52],[54,49,55,52],[56,49,57,52],[48,23,49,48],[84,49,85,52],[86,49,87,52],[88,49,89,52],[90,49,91,52],[76,19,77,22],[76,23,77,48],[13,19,14,34],[16,19,17,34],[13,3,14,17],[16,3,17,17],[13,36,14,51],[16,36,17,51],[54,19,55,22],[54,23,55,48],[56,19,57,22],[56,23,57,48],[50,19,51,22],[50,23,51,48],[52,19,53,22],[52,23,53,48],[58,19,59,22],[58,23,59,48],[60,19,61,22],[60,23,61,48],[90,19,91,22],[90,23,91,48],[92,19,93,22],[94,19,95,22],[88,19,89,22],[88,23,89,48],[62,19,63,22],[62,23,63,48],[64,19,65,22],[64,23,65,48],[72,23,73,48],[74,19,75,22],[74,23,75,48],[66,23,67,48],[68,19,69,22],[68,23,69,48],[19,3,28,17],[31,19,33,22],[31,23,33,48],[34,23,35,48],[34,19,35,22],[36,19,37,22],[36,23,37,48],[38,19,39,22],[38,23,39,48],[22,48,23,51],[19,36,21,47],[19,48,21,51],[22,36,23,47],[24,48,25,51],[24,36,25,47],[26,48,28,51],[26,44,27,47],[26,39,27,43],[26,36,27,38],[28,44,28,47],[31,49,33,52],[23,26,23,29],[26,27,26,31],[28,39,28,43],[28,36,28,38],[96,19,97,22],[98,19,99,22],[78,19,79,22],[78,23,79,48],[80,19,81,22],[80,23,81,48],[82,19,83,22],[82,23,83,48],[84,19,85,22],[84,23,85,48],[86,19,87,22],[86,23,87,48],[72,19,73,22],[66,19,67,22],[42,19,43,22],[42,23,43,48],[44,19,45,22],[44,23,45,48],[46,19,47,22],[46,23,47,48],[48,19,49,22],[70,19,71,22],[70,23,71,48]]}
[]
[null,null,null,null,null,null,null,null,null,null,null,null,null,null,null,null,"شرح خدمات سرویس های ادواری محصولات کرمان موتور\n(JAC,LIFAN,Geely)"]
[]
[]
[]
[]
[]
[]
[]
[]
[]
[]
[]
[null,null,null,"نوع سرویس",null,null,null,null,null,null,null,null,null,null,null,null,null,null,null,"نوع خودرو",null,null,null,null,null,null,null,null,null,null,null,null,null,null,null,null,"کد نمایندگی"]
[]
[]
[null,null,null,"سرویس اولیه",null,null,null,null,null,null,null,null,null,null,null,null,null,null,null,"LIFAN_X70(CVT)",null,null,null,null,null,null,null,null,null,null,null,null,null,null,null,null,1003]
[]
[]
[null,null,null,null,null,null,null,null,null,null,null,null,null,null,null,null,null,null,null,null,null,null,null,null,null,null,null,null,null,null,null,null,null,null,null,null,{"$f":"IFERROR(VLOOKUP(AK17,Sheet1!A:B,2,0),\"_\")","v":"شرکت رصد خودرو مراغه "},null,null,null,null,null,null,null,null,null,null,null,"نام شرکت"]
[]
[]
[null,null,null,null,null,null,null,null,null,null,null,null,null,null,null,null,null,null,null,null,null,null,null,null,null,null,null,null,null,null,null,null,null,null,null,null,{"$f":"IFERROR(VLOOKUP(AK17,Sheet1!A:D,3,0),\"_\")","v":"آذربایجان شرقی"},null,null,null,null,null,null,null,null,null,null,null,"استان"]
[]
[null,null,null,null,null,null,null,null,null,null,null,null,null,null,null,null,null,null,null,null,null,null,null,null,null,null,null,null,null,null,null,null,null,null,null,null,{"$f":"IFERROR(VLOOKUP(AK17,Sheet1!A:D,4,0),\"_\")","v":"مراغه"},null,null,null,null,null,null,null,null,null,null,null,"شهر"]
[]
[null,null,null,null,null,null,null,null,null,null,null,null,null,null,null,null,null,null,null,null,null,null,null,null,null,null,null,null,null,null,null,null,null,null,null,null,"خدمات در محل",null,null,"خدمات پس از فروش",null,null,null,null,"فروش و خدمات پس از فروش",null,null,null,"نوع نمایندگی"]
[]
[null,null,null,null,null,null,null,null,null,null,null,null,null,null,null,null,null,null,null,null,null,null,null,null,null,null,null,null,null,null,null,null,null,null,null,null,{"$f":"IF(VLOOKUP($AK$17,Sheet1!$A:$H,8,0)=AK27,\"P\",\"Ï\")","v":"Ï"},null,null,{"$f":"IF(VLOOKUP($AK$17,Sheet1!$A:$H,8,0)=AN27,\"P\",\"Ï\")","v":"Ï"},null,null,null,null,{"$f":"IF(VLOOKUP($AK$17,Sheet1!$A:$H,8,0)=AS27,\"P\",\"Ï\")","v":"P"}]
[]
{"$rows_left_out":70}
{"sheet":"راهنما","index":1,"n_rows":1,"n_cols":4,"rows_kept":1,"cut":false,"hidden":false,"merged":[[0,3,1,12]]}
[null,null,null,"راهنمای استفاده از نرم افزار سرویس های ادواری محصولات کرمان موتور"]

{"sheet":"Sheet2","index":2,"n_rows":329,"n_cols":61,"rows_kept":329,"cut":false,"hidden":true,"merged":[]}
[null,null,"شرح خدمات ","سرویس اولیه",10000,15000,20000,25000,30000,35000,40000,45000,50000,55000,60000,65000,70000,75000,80000,85000,90000,95000,100000,105000,110000,115000,120000,125000,130000,135000,140000,145000,150000,155000,160000,165000,170000,175000,180000,185000,190000,195000,200000,null,null,null,null,"جمع اجرت برحسب (نفر-ساعت) در مدل دنده ای ",null,null,{"$f":"Profile!T17","v":"LIFAN_X70(CVT)"},null,null,null,null,"سرویس اولیه",null,null,null,"Geely_GC6",{"$f":"COUNTIF(B:B,BH1)","v":29}]
[{"$f":"IF(OR(C2=$AV$1,C2=$AV$2),\"\",IF(B2<>Profile!$T$17,\"\",COUNTIF(Sheet2!$B$2:B2,Profile!$T$17)))","v":""},"LIFAN_820","روغن موتور به همراه فیلتر روغن(1)","تعویض","تعویض","تعویض","تعویض","تعویض","تعویض","تعویض","تعویض","تعویض","تعویض","تعویض","تعویض","تعویض","تعویض","تعویض","تعویض","تعویض","تعویض","تعویض","تعویض","تعویض","تعویض","تعویض","تعویض","تعویض","تعویض","تعویض","تعویض","تعویض","تعویض","_","_","_","_","_","_","_","_","_","_",null,null,null,null,"جمع اجرت برحسب (نفر-ساعت) در مدل اتومات",null,null,{"$f":"MATCH(AY1&AV1,B:B&C:C,0)","v":{"$error":"#N/A"}},null,null,null,null,10000,null,null,null,"JAC_J4 CVT",{"$f":"COUNTIF(B:B,BH2)","v":30}]
[{"$f":"IF(OR(C3=$AV$1,C3=$AV$2),\"\",IF(B3<>Profile!$T$17,\"\",COUNTIF(Sheet2!$B$2:B3,Profile!$T$17)))","v":""},"LIFAN_820","فیلتر هوای موتور","بازدید","بازدید","بازدید","تعویض","تعویض","تعویض","تعویض","تعویض","تعویض","تعویض","تعویض","تعویض","تعویض","تعویض","تعویض","تعویض","تعویض","تعویض","تعویض","تعویض","تعویض","تعویض","تعویض","تعویض","تعویض","تعویض","تعویض","تعویض","تعویض","تعویض","_","_","_","_","_","_","_","_","_","_",null,null,null,null,null,null,null,{"$f":"MATCH(AY1&AV2,B:B&C:C,0)","v":292},null,null,null,null,15000,null,null,null,"JAC_J5(AT-MT)",31]
[{"$f":"IF(OR(C4=$AV$1,C4=$AV$2),\"\",IF(B4<>Profile!$T$17,\"\",COUNTIF(Sheet2!$B$2:B4,Profile!$T$17)))","v":""},"LIFAN_820","فیلتر اتاق (تهویه مطبوع)","_","بازدید","_","تعویض","_","تعویض","_","تعویض","_","تعویض","_","تعویض","_","تعویض","_","تعویض","_","تعویض","_","تعویض","_","تعویض","_","تعویض","_","تعویض","_","تعویض","_","تعویض","_","_","_","_","_","_","_","_","_","_",null,null,null,null,null,null,null,null,null,null,null,null,20000,null,null,null,"JAC_S3-CVT",30]
[{"$f":"IF(OR(C5=$AV$1,C5=$AV$2),\"\",IF(B5<>Profile!$T$17,\"\",COUNTIF(Sheet2!$B$2:B5,Profile!$T$17)))","v":""},"LIFAN_820","کانکتورها ، اتصالات برقی بدنه و سنسور ها ","بازدید","_","_","_","_","_","_","_","_","بازدید","_","_","_","_","_","_","_","_","_","_","_","_","_","_","_","_","_","_","_","بازدید","_","_","_","_","_","_","_","_","_","_",null,null,null,null,null,null,null,null,null,null,null,null,25000,null,null,null,"JAC_S5(AT-MT)",31]
[{"$f":"IF(OR(C6=$AV$1,C6=$AV$2),\"\",IF(B6<>Profile!$T$17,\"\",COUNTIF(Sheet2!$B$2:B6,Profile!$T$17)))","v":""},"LIFAN_820","باک بنزین ، لوله ها و اتصالات آن و متعلقات سوخت رسانی از نظر وجود نشتی ","بازدید","_","_","_","_","بازدید","_","_","_","_","_","بازدید","_","_","_","_","_","بازدید","_","_","_","_","_","بازدید","_","_","_","_","_","بازدید","_","_","_","_","_","_","_","_","_","_",null,null,null,null,null,null,null,null,null,null,null,null,30000,null,null,null,"JAC_T8 MT",37]
[{"$f":"IF(OR(C7=$AV$1,C7=$AV$2),\"\",IF(B7<>Profile!$T$17,\"\",COUNTIF(Sheet2!$B$2:B7,Profile!$T$17)))","v":""},"LIFAN_820","تسمه ها از نظر وجود پلیسه ، سائیدگی و کشش","بازدید","_","_","_","_","_","_","بازدید","_","_","_","بازدید","_","_","_","بازدید","_","_","_","بازدید","_","_","_","بازدید","_","_","_","_","_","بازدید","_","_","_","_","_","_","_","_","_","_",null,null,null,null,null,null,null,null,null,null,null,null,35000,null,null,null,"LIFAN_620(1.6-1.8)",26]
[{"$f":"IF(OR(C8=$AV$1,C8=$AV$2),\"\",IF(B8<>Profile!$T$17,\"\",COUNTIF(Sheet2!$B$2:B8,Profile!$T$17)))","v":""},"LIFAN_820","فیلتر بنزین (2)","بازدید","_","تعویض","_","_","تعویض","_","_","تعویض","_","_","تعویض","_","_","تعویض","_","_","تعویض","_","_","تعویض","_","_","تعویض","_","_","تعویض","_","_","تعویض","_","_","_","_","_","_","_","_","_","_",null,null,null,null,null,null,null,null,null,null,null,null,40000,null,null,null,"LIFAN_820",27]
[{"$f":"IF(OR(C9=$AV$1,C9=$AV$2),\"\",IF(B9<>Profile!$T$17,\"\",COUNTIF(Sheet2!$B$2:B9,Profile!$T$17)))","v":""},"LIFAN_820"," خلاصی پدال ترمز و رگلاژ ترمز پارک ","تنظیم","_","_","_","_","تنظیم","_","_","_","_","_","تنظیم","_","_","_","_","_","تنظیم","_","_","_","_","_","تنظیم","_","_","_","_","_","تنظیم","_","_","_","_","_","_","_","_","_","_",null,null,null,null,null,null,null,null,null,null,null,null,45000,null,null,null,"LIFAN_X50(AT-MT)",30]
[{"$f":"IF(OR(C10=$AV$1,C10=$AV$2),\"\",IF(B10<>Profile!$T$17,\"\",COUNTIF(Sheet2!$B$2:B10,Profile!$T$17)))","v":""},"LIFAN_820","لنت های ترمز و دیسک ترمز چرخها","بازدید","_","_","بازدید","_","_","_","بازدید","_","_","_","بازدید","_","_","_","بازدید","_","_","_","بازدید","_","_","_","بازدید","_","_","_","بازدید","_","_","_","_","_","_","_","_","_","_","_","_",null,null,null,null,null,null,null,null,null,null,null,null,50000,null,null,null,"LIFAN_X60(AT-MT)",30]
[{"$f":"IF(OR(C11=$AV$1,C11=$AV$2),\"\",IF(B11<>Profile!$T$17,\"\",COUNTIF(Sheet2!$B$2:B11,Profile!$T$17)))","v":""},"LIFAN_820","زوایای چرخهای جلو و عقب ","بازدید","بازدید","بازدید","بازدید","بازدید","بازدید","بازدید","بازدید","بازدید","بازدید","بازدید","بازدید","بازدید","بازدید","بازدید","بازدید","بازدید","بازدید","بازدید","بازدید","بازدید","بازدید","بازدید","بازدید","بازدید","بازدید","بازدید","بازدید","بازدید","بازدید","_","_","_","_","_","_","_","_","_","_",null,null,null,null,null,null,null,null,null,null,null,null,55000,null,null,null,"LIFAN_X70(CVT)",27]
[{"$f":"IF(OR(C12=$AV$1,C12=$AV$2),\"\",IF(B12<>Profile!$T$17,\"\",COUNTIF(Sheet2!$B$2:B12,Profile!$T$17)))","v":""},"LIFAN_820","تایرها و باد لاستیک ها","بازدید","بازدید","بازدید","بازدید","بازدید","بازدید","بازدید","بازدید","بازدید","بازدید","بازدید","بازدید","بازدید","بازدید","بازدید","بازدید","بازدید","بازدید","بازدید","بازدید","بازدید","بازدید","بازدید","بازدید","بازدید","بازدید","بازدید","بازدید","بازدید","بازدید","_","_","_","_","_","_","_","_","_","_",null,null,null,null,null,null,null,null,null,null,null,null,60000]
[{"$f":"IF(OR(C13=$AV$1,C13=$AV$2),\"\",IF(B13<>Profile!$T$17,\"\",COUNTIF(Sheet2!$B$2:B13,Profile!$T$17)))","v":""},"LIFAN_820","روغن گیربکس مدل اتوماتیک ","بازدید","_","_","_","_","بازدید","_","_","_","_","_","تعویض","_","_","_","_","_","بازدید","_","_","_","_","_","تعویض","_","_","_","_","_","بازدید","_","_","_","_","_","_","_","_","_","_",null,null,null,null,null,null,null,null,null,null,null,null,65000]
[{"$f":"IF(OR(C14=$AV$1,C14=$AV$2),\"\",IF(B14<>Profile!$T$17,\"\",COUNTIF(Sheet2!$B$2:B14,Profile!$T$17)))","v":""},"LIFAN_820","لوله ها و اتصالات گیربکس اتوماتیک","بازدید","بازدید","بازدید","بازدید","بازدید","بازدید","بازدید","بازدید","بازدید","بازدید","بازدید","بازدید","بازدید","بازدید","بازدید","بازدید","بازدید","بازدید","بازدید","بازدید","بازدید","بازدید","بازدید","بازدید","بازدید","بازدید","بازدید","بازدید","بازدید","بازدید","_","_","_","_","_","_","_","_","_","_",null,null,null,null,null,null,null,null,null,null,null,null,70000]
[{"$f":"IF(OR(C15=$AV$1,C15=$AV$2),\"\",IF(B15<>Profile!$T$17,\"\",COUNTIF(Sheet2!$B$2:B15,Profile!$T$17)))","v":""},"LIFAN_820","عملکرد سیستم کولر و بخاری ","بازدید","_","_","_","_","_","_","_","_","_","_","بازدید","_","_","_","_","_","_","_","بازدید","_","_","_","_","_","_","_","بازدید","_","_","_","_","_","_","_","_","_","_","_","_",null,null,null,null,null,null,null,null,null,null,null,null,75000]
[{"$f":"IF(OR(C16=$AV$1,C16=$AV$2),\"\",IF(B16<>Profile!$T$17,\"\",COUNTIF(Sheet2!$B$2:B16,Profile!$T$17)))","v":""},"LIFAN_820","سیستم خنک کاری موتور(رله وفن ها و نشتی ازلوله ها و رادیاتورو سطح مایع خنک کننده به همراه ضدیخ)(4)","بازدید","_","_","بازدید","_","_","_","تعویض","_","_","_","بازدید","_","_","_","تعویض","_","_","_","بازدید","_","_","_","تعویض","_","_","_","بازدید","_","_","_","_","_","_","_","_","_","_","_","_",null,null,null,null,null,null,null,null,null,null,null,null,80000]
[{"$f":"IF(OR(C17=$AV$1,C17=$AV$2),\"\",IF(B17<>Profile!$T$17,\"\",COUNTIF(Sheet2!$B$2:B17,Profile!$T$17)))","v":""},"LIFAN_820","باتری خودرو ","بازدید","_","_","بازدید","_","بازدید","_","_","_","_","_","بازدید","_","_","_","_","_","بازدید","_","_","_","_","_","بازدید","_","_","_","_","_","بازدید","_","_","_","_","_","_","_","_","_","_",null,null,null,null,null,null,null,null,null,null,null,null,85000]
[{"$f":"IF(OR(C18=$AV$1,C18=$AV$2),\"\",IF(B18<>Profile!$T$17,\"\",COUNTIF(Sheet2!$B$2:B18,Profile!$T$17)))","v":""},"LIFAN_820","بلبرینگ چرخ ها  و درپوش آنها ","بازدید","_","_","بازدید","_","_","_","بازدید","_","_","_","بازدید","_","_","_","بازدید","_","_","_","بازدید","_","_","_","بازدید","_","_","_","بازدید","_","_","_","_","_","_","_","_","_","_","_","_",null,null,null,null,null,null,null,null,null,null,null,null,90000]
[{"$f":"IF(OR(C19=$AV$1,C19=$AV$2),\"\",IF(B19<>Profile!$T$17,\"\",COUNTIF(Sheet2!$B$2:B19,Profile!$T$17)))","v":""},"LIFAN_820","شمع های موتور ","_","_","_","_","_","_","_","تعویض","_","_","_","_","_","_","_","تعویض","_","_","_","_","_","_"," ","تعویض","_","_","_","_","_","_","_","_","_","_","_","_","_","_","_","_",null,null,null,null,null,null,null,null,null,null,null,null,95000]
[{"$f":"IF(OR(C20=$AV$1,C20=$AV$2),\"\",IF(B20<>Profile!$T$17,\"\",COUNTIF(Sheet2!$B$2:B20,Profile!$T$17)))","v":""},"LIFAN_820","عملکرد مکانیزم سانروف و یا نشتی آب ","بازدید","_","_","_","_","_","_","_","_","_","_","_","_","_","_","_","_","_","_","_","_","_","_","_","_","_","_","_","_","_","_","_","_","_","_","_","_","_","_","_",null,null,null,null,null,null,null,null,null,null,null,null,100000]
[{"$f":"IF(OR(C21=$AV$1,C21=$AV$2),\"\",IF(B21<>Profile!$T$17,\"\",COUNTIF(Sheet2!$B$2:B21,Profile!$T$17)))","v":""},"LIFAN_820","شلینگ و سوپاپ  تخلیه بخارات کارتل ( PCV ) ","بازدید","_","_","_","_","_","_","بازدید","_","_","_","_","_","_","_","بازدید","_","_","_","_","_","_","_","بازدید","_","_","_","_","_","_","_","_","_","_","_","_","_","_","_","_",null,null,null,null,null,null,null,null,null,null,null,null,105000]
[{"$f":"IF(OR(C22=$AV$1,C22=$AV$2),\"\",IF(B22<>Profile!$T$17,\"\",COUNTIF(Sheet2!$B$2:B22,Profile!$T$17)))","v":""},"LIFAN_820","گردگیرهای پلوس و سیبک ها ","بازدید","_","_","_","_","_","_","بازدید","_","_","_","بازدید","_","_","_","بازدید","_","_","_","بازدید","_","_","_","بازدید","_","_","_","بازدید","_","_","_","_","_","_","_","_","_","_","_","_",null,null,null,null,null,null,null,null,null,null,null,null,110000]
[{"$f":"IF(OR(C23=$AV$1,C23=$AV$2),\"\",IF(B23<>Profile!$T$17,\"\",COUNTIF(Sheet2!$B$2:B23,Profile!$T$17)))","v":""},"LIFAN_820","شلنگ ها و اتصالات و لوله های ترمز از نظر وجود نشتی و سطح روغن ترمز  ","بازدید","بازدید","بازدید","بازدید","بازدید","بازدید","بازدید","بازدید","بازدید","بازدید","بازدید","بازدید","بازدید","بازدید","بازدید","بازدید","بازدید","بازدید","بازدید","بازدید","بازدید","بازدید","بازدید","بازدید","بازدید","بازدید","بازدید","بازدید","بازدید","بازدید","_","_","_","_","_","_","_","_","_","_",null,null,null,null,null,null,null,null,null,null,null,null,115000]
[{"$f":"IF(OR(C24=$AV$1,C24=$AV$2),\"\",IF(B24<>Profile!$T$17,\"\",COUNTIF(Sheet2!$B$2:B24,Profile!$T$17)))","v":""},"LIFAN_820","کلیه چراغ های (لامپ ها) داخلی و خارجی خودرو ","بازدید","بازدید","بازدید","بازدید","بازدید","بازدید","بازدید","بازدید","بازدید","بازدید","بازدید","بازدید","بازدید","بازدید","بازدید","بازدید","بازدید","بازدید","بازدید","بازدید","بازدید","بازدید","بازدید","بازدید","بازدید","بازدید","بازدید","بازدید","بازدید","بازدید","_","_","_","_","_","_","_","_","_","_",null,null,null,null,null,null,null,null,null,null,null,null,120000]
[{"$f":"IF(OR(C25=$AV$1,C25=$AV$2),\"\",IF(B25<>Profile!$T$17,\"\",COUNTIF(Sheet2!$B$2:B25,Profile!$T$17)))","v":""},"LIFAN_820","آچارکشی کامل خودرو (3)","تنظیم","_","_","تنظیم","_","تنظیم","_","تنظیم","_","تنظیم","_","تنظیم","_","تنظیم","_","تنظیم","_","تنظیم","_","تنظیم","_","تنظیم","_","تنظیم","_","تنظیم","_","تنظیم","_","تنظیم","_","_","_","_","_","_","_","_","_","_",null,null,null,null,null,null,null,null,null,null,null,null,125000]
[{"$f":"IF(OR(C26=$AV$1,C26=$AV$2),\"\",IF(B26<>Profile!$T$17,\"\",COUNTIF(Sheet2!$B$2:B26,Profile!$T$17)))","v":""},"LIFAN_820","روغن هیدرولیک فرمان (هردوسال یا30000کیلومتر تعویض گردد)","بازدید","_","_","بازدید","_","تعویض","_","بازدید","_","_","_","تعویض","_","بازدید","_","_","_","تعویض","_","بازدید","_","_","_","تعویض","_","بازدید","_","_","_","تعویض","_","_","_","_","_","_","_","_","_","_",null,null,null,null,null,null,null,null,null,null,null,null,130000]
[{"$f":"IF(OR(C27=$AV$1,C27=$AV$2),\"\",IF(B27<>Profile!$T$17,\"\",COUNTIF(Sheet2!$B$2:B27,Profile!$T$17)))","v":""},"LIFAN_820","کلیه سیستم های الکتریکی (شامل ترمز و ایربگ و موتور و گیربکس اتوماتیک  و .....) ","بازدید","_","_","_","_","_","_","بازدید","_","_","_","_","_","_","_","بازدید","_","_","_","_","_","_","_","بازدید","_","_","_","_","_","_","_","_","_","_","_","_","_","_","_","_",null,null,null,null,null,null,null,null,null,null,null,null,135000]
[{"$f":"IF(OR(C28=$AV$1,C28=$AV$2),\"\",IF(B28<>Profile!$T$17,\"\",COUNTIF(Sheet2!$B$2:B28,Profile!$T$17)))","v":""},"LIFAN_820","جمع اجرت برحسب (نفر-ساعت) در مدل اتومات","_",120,125,172,105,235,105,262,125,165,105,290,105,152,125,260,105,235,105,182,125,150,105,370,105,152,125,175,105,255,"_","_","_","_","_","_","_","_","_","_",null,null,null,null,null,null,null,null,null,null,null,null,140000]
[{"$f":"IF(OR(C29=$AV$1,C29=$AV$2),\"\",IF(B29<>Profile!$T$17,\"\",COUNTIF(Sheet2!$B$2:B29,Profile!$T$17)))","v":""},"LIFAN_X60(AT-MT)","روغن موتور به همراه فیلتر روغن(1)","تعویض","تعویض","تعویض","تعویض","تعویض","تعویض","تعویض","تعویض","تعویض","تعویض","تعویض","تعویض","تعویض","تعویض","تعویض","تعویض","تعویض","تعویض","تعویض","تعویض","_","_","_","_","_","_","_","_","_","_","_","_","_","_","_","_","_","_","_","_",null,null,null,null,null,null,null,null,null,null,null,null,145000]
[{"$f":"IF(OR(C30=$AV$1,C30=$AV$2),\"\",IF(B30<>Profile!$T$17,\"\",COUNTIF(Sheet2!$B$2:B30,Profile!$T$17)))","v":""},"LIFAN_X60(AT-MT)","فیلتر اتاق (تهویه مطبوع)","بازدید","تعویض","_","تعویض","_","تعویض","_","تعویض","_","تعویض","_","تعویض","_","تعویض","_","تعویض","_","تعویض","_","تعویض","_","_","_","_","_","_","_","_","_","_","_","_","_","_","_","_","_","_","_","_",null,null,null,null,null,null,null,null,null,null,null,null,150000]
{"$rows_left_out":300}
{"sheet":"Sheet1","index":3,"n_rows":107,"n_cols":11,"rows_kept":107,"cut":false,"hidden":true,"merged":[]}
[]
[null,null,null,null,null,null,null,null,null,null,"نوع نمایندگی"]
["کد نمایندگی","نام صاحب امتیاز","استان","شهر","تلفن واحد خدمات پس از فروش","آدرس","اجرت 99","نوع نمایندگی",null,null,"فروش و خدمات پس از فروش"]
[1001,"شرکت تیزران خودرو تبریز","آذربایجان شرقی","تبريز",null,null,860000,"فروش و خدمات پس از فروش",null,null,"خدمات پس از فروش"]
[1002,"شرکت بانیان خودرو خودکار","آذربایجان شرقی","تبريز",null,null,703000,"فروش و خدمات پس از فروش",null,null,"خدمات در محل"]
[1003,"شرکت رصد خودرو مراغه ","آذربایجان شرقی","مراغه",null,null,703000,"فروش و خدمات پس از فروش"]
[1004,"یوسف داودی","آذربایجان شرقی","سراب",null,null,469000,"فروش و خدمات پس از فروش"]
[1007,"شرکت ایماژ خودرو ایرانیان ","آذربایجان شرقی","تبريز",null,null,782000,"فروش و خدمات پس از فروش"]
[1008,"عبد الاحد بزازوری","آذربایجان شرقی","تبريز",null,null,625000,"فروش و خدمات پس از فروش"]
[1104,"اسماعیل منسوبی","آذربايجان غربي","سلماس",null,null,703000,"فروش و خدمات پس از فروش"]
[1107,"روح الله غلام زاده","آذربايجان غربي","ارومیه",null,null,703000,"فروش و خدمات پس از فروش"]
[1109,"کمال نادربر","آذربايجان غربي","ارومیه",null,null,625000,"فروش و خدمات پس از فروش"]
[1201,"صالح فصاحتي","اردبیل","اردبيل",null,null,782000,"فروش و خدمات پس از فروش"]
[1202,"صابر شهباز علیزاده","اردبیل","اردبيل",null,null,547000,"فروش و خدمات پس از فروش"]
[1203,"محمد قبادی جمادی","اردبیل","اردبيل",null,null,625000,"فروش و خدمات پس از فروش"]
[1301,"عباس حاجی نیلی","اصفهان","اصفهان",null,null,782000,"فروش و خدمات پس از فروش"]
[1302,"احمد بشتام","اصفهان","اصفهان",null,null,782000,"فروش و خدمات پس از فروش"]
[1303,"فضل الله ادیب نیا","اصفهان","شهرضا",null,null,703000,"فروش و خدمات پس از فروش"]
[1304,"شرکت حافظ قطعات","اصفهان","اصفهان",null,null,703000,"فروش و خدمات پس از فروش"]
[1305,"عبد الرضا فیروزبخش","اصفهان","فولادشهر",null,null,703000,"فروش و خدمات پس از فروش"]
[1308,"سعید فخارزاده","اصفهان","کاشان",null,null,625000,"فروش و خدمات پس از فروش"]
[1309,"فرزاد کریمی مقدم","اصفهان","شاهین شهر",null,null,469000,"فروش و خدمات پس از فروش"]
[1310,"شرکت آسیا بانژ ","اصفهان","اصفهان",null,null,782000,"فروش و خدمات پس از فروش"]
[1311,"رحمن فاتحی","اصفهان","خمینی شهر",null,null,703000,"فروش و خدمات پس از فروش"]
[1402,"رسول صفری","البرز","کرج",null,null,782000,"فروش و خدمات پس از فروش"]
[1408,"پیمان آزموده فرد","البرز","کرج",null,null,782000,"فروش و خدمات پس از فروش"]
[1409,"ستار روائی","البرز","کرج",null,null,860000,"فروش و خدمات پس از فروش"]
[1412,"حمید ابراهیمی بسابی","البرز","کرج",null,null,782000,"فروش و خدمات پس از فروش"]
[1501,"یاسان رئیسی","ایلام","ایلام",null,null,703000,"فروش و خدمات پس از فروش"]
[1601,"عبد المحمد کاردانی","بوشهر","بوشهر",null,null,782000,"فروش و خدمات پس از فروش"]
{"$rows_left_out":78}
{"sheet":"picture","index":4,"n_rows":11,"n_cols":1,"rows_kept":11,"cut":false,"hidden":true,"merged":[]}
["Geely_GC6"]
["JAC_J4 CVT"]
["JAC_J5(AT-MT)"]
["JAC_S3-CVT"]
["JAC_S5(AT-MT)"]
["LIFAN_620(1.6-1.8)"]
["LIFAN_820"]
["LIFAN_X50(AT-MT)"]
["LIFAN_X60(AT-MT)"]
["LIFAN_X70(CVT)"]
["JAC_T8 MT"]